{"text_format":"1","workbook":"xlsx","n_sheets":8,"sheets":["INPUT","1","2","3","4","5","6","7"],"not_rendered":{"charts":0,"images":0,"macros":1,"external_links":0,"defined_names":9,"comments":1,"pivot_tables":0},"unopened":[],"bounds":{"document_bytes":16777216,"sheet_cells":100000,"rows_first":2000,"rows_last":500,"rows_between":2000,"halvings":0,"cell_chars":16384,"cell_head_chars":4096},"cells_cut":0,"cells_raw":0,"read":"whole","date_system":"1900"}

{"sheet":"INPUT","index":0,"n_rows":402,"n_cols":10,"rows_kept":402,"cut":false,"hidden":false,"merged":[[0,0,0,2],[1,4,1,6],[0,4,0,6]]}
["SILAKAN INPUTKA PESERTA",null,null,null,"SILAKAN INPUT DATA MATAKULIAH",null,null,null,1]
["NO","NIM","NAMA",null,"DATA MATAKULIAH",null,null,null,2,{"$f":"IFERROR(INDEX(#REF!,MATCH(INPUT!$G$5,#REF!,0)),\"\")","v":""}]
[{"$f":"IF(B3<>\"\",COUNTA($B$3:B3)&\"\",\"\")","v":""},null,{"$f":"IFERROR(INDEX(#REF!,MATCH(INPUT!$B3,#REF!,0)),\"\")","v":""},null,"NAMA MATAKULIAH",":",null,null,3,{"$f":"IFERROR(INDEX(#REF!,MATCH(INPUT!$G$5,#REF!,0)),\"\")","v":""}]
[{"$f":"IF(B4<>\"\",COUNTA($B$3:B4)&\"\",\"\")","v":""},null,{"$f":"IFERROR(INDEX(#REF!,MATCH(INPUT!$B4,#REF!,0)),\"\")","v":""},null,"KODE MATAKULIAH",":",null,null,4]
[{"$f":"IF(B5<>\"\",COUNTA($B$3:B5)&\"\",\"\")","v":""},null,{"$f":"IFERROR(INDEX(#REF!,MATCH(INPUT!$B5,#REF!,0)),\"\")","v":""},null,"SEMESTER",":",null,null,5]
[{"$f":"IF(B6<>\"\",COUNTA($B$3:B6)&\"\",\"\")","v":""},null,{"$f":"IFERROR(INDEX(#REF!,MATCH(INPUT!$B6,#REF!,0)),\"\")","v":""},null,"TAHUN AKADEMIK",":",null,null,6]
[{"$f":"IF(B7<>\"\",COUNTA($B$3:B7)&\"\",\"\")","v":""},null,{"$f":"IFERROR(INDEX(#REF!,MATCH(INPUT!$B7,#REF!,0)),\"\")","v":""},null,"NAMA DOSEN",":",null,null,7]
[{"$f":"IF(B8<>\"\",COUNTA($B$3:B8)&\"\",\"\")","v":""},null,{"$f":"IFERROR(INDEX(#REF!,MATCH(INPUT!$B8,#REF!,0)),\"\")","v":""},null,"PRESENSI",":"]
[{"$f":"IF(B9<>\"\",COUNTA($B$3:B9)&\"\",\"\")","v":""},null,{"$f":"IFERROR(INDEX(#REF!,MATCH(INPUT!$B9,#REF!,0)),\"\")","v":""},null,"PRINT BERAPA KALI",":"]
[{"$f":"IF(B10<>\"\",COUNTA($B$3:B10)&\"\",\"\")","v":""},null,{"$f":"IFERROR(INDEX(#REF!,MATCH(INPUT!$B10,#REF!,0)),\"\")","v":""}]
[{"$f":"IF(B11<>\"\",COUNTA($B$3:B11)&\"\",\"\")","v":""},null,{"$f":"IFERROR(INDEX(#REF!,MATCH(INPUT!$B11,#REF!,0)),\"\")","v":""}]
[{"$f":"IF(B12<>\"\",COUNTA($B$3:B12)&\"\",\"\")","v":""},null,{"$f":"IFERROR(INDEX(#REF!,MATCH(INPUT!$B12,#REF!,0)),\"\")","v":""}]
[{"$f":"IF(B13<>\"\",COUNTA($B$3:B13)&\"\",\"\")","v":""},null,{"$f":"IFERROR(INDEX(#REF!,MATCH(INPUT!$B13,#REF!,0)),\"\")","v":""}]
[{"$f":"IF(B14<>\"\",COUNTA($B$3:B14)&\"\",\"\")","v":""},null,{"$f":"IFERROR(INDEX(#REF!,MATCH(INPUT!$B14,#REF!,0)),\"\")","v":""}]
[{"$f":"IF(B15<>\"\",COUNTA($B$3:B15)&\"\",\"\")","v":""},null,{"$f":"IFERROR(INDEX(#REF!,MATCH(INPUT!$B15,#REF!,0)),\"\")","v":""}]
[{"$f":"IF(B16<>\"\",COUNTA($B$3:B16)&\"\",\"\")","v":""},null,{"$f":"IFERROR(INDEX(#REF!,MATCH(INPUT!$B16,#REF!,0)),\"\")","v":""}]
[{"$f":"IF(B17<>\"\",COUNTA($B$3:B17)&\"\",\"\")","v":""},null,{"$f":"IFERROR(INDEX(#REF!,MATCH(INPUT!$B17,#REF!,0)),\"\")","v":""}]
[{"$f":"IF(B18<>\"\",COUNTA($B$3:B18)&\"\",\"\")","v":""},null,{"$f":"IFERROR(INDEX(#REF!,MATCH(INPUT!$B18,#REF!,0)),\"\")","v":""}]
[{"$f":"IF(B19<>\"\",COUNTA($B$3:B19)&\"\",\"\")","v":""},null,{"$f":"IFERROR(INDEX(#REF!,MATCH(INPUT!$B19,#REF!,0)),\"\")","v":""}]
[{"$f":"IF(B20<>\"\",COUNTA($B$3:B20)&\"\",\"\")","v":""},null,{"$f":"IFERROR(INDEX(#REF!,MATCH(INPUT!$B20,#REF!,0)),\"\")","v":""}]
[{"$f":"IF(B21<>\"\",COUNTA($B$3:B21)&\"\",\"\")","v":""},null,{"$f":"IFERROR(INDEX(#REF!,MATCH(INPUT!$B21,#REF!,0)),\"\")","v":""}]
[{"$f":"IF(B22<>\"\",COUNTA($B$3:B22)&\"\",\"\")","v":""},null,{"$f":"IFERROR(INDEX(#REF!,MATCH(INPUT!$B22,#REF!,0)),\"\")","v":""}]
[{"$f":"IF(B23<>\"\",COUNTA($B$3:B23)&\"\",\"\")","v":""},null,{"$f":"IFERROR(INDEX(#REF!,MATCH(INPUT!$B23,#REF!,0)),\"\")","v":""}]
[{"$f":"IF(B24<>\"\",COUNTA($B$3:B24)&\"\",\"\")","v":""},null,{"$f":"IFERROR(INDEX(#REF!,MATCH(INPUT!$B24,#REF!,0)),\"\")","v":""}]
[{"$f":"IF(B25<>\"\",COUNTA($B$3:B25)&\"\",\"\")","v":""},null,{"$f":"IFERROR(INDEX(#REF!,MATCH(INPUT!$B25,#REF!,0)),\"\")","v":""}]
[{"$f":"IF(B26<>\"\",COUNTA($B$3:B26)&\"\",\"\")","v":""},null,{"$f":"IFERROR(INDEX(#REF!,MATCH(INPUT!$B26,#REF!,0)),\"\")","v":""}]
[{"$f":"IF(B27<>\"\",COUNTA($B$3:B27)&\"\",\"\")","v":""},null,{"$f":"IFERROR(INDEX(#REF!,MATCH(INPUT!$B27,#REF!,0)),\"\")","v":""}]
[{"$f":"IF(B28<>\"\",COUNTA($B$3:B28)&\"\",\"\")","v":""},null,{"$f":"IFERROR(INDEX(#REF!,MATCH(INPUT!$B28,#REF!,0)),\"\")","v":""}]
[{"$f":"IF(B29<>\"\",COUNTA($B$3:B29)&\"\",\"\")","v":""},null,{"$f":"IFERROR(INDEX(#REF!,MATCH(INPUT!$B29,#REF!,0)),\"\")","v":""}]
[{"$f":"IF(B30<>\"\",COUNTA($B$3:B30)&\"\",\"\")","v":""},null,{"$f":"IFERROR(INDEX(#REF!,MATCH(INPUT!$B30,#REF!,0)),\"\")","v":""}]
[{"$f":"IF(B31<>\"\",COUNTA($B$3:B31)&\"\",\"\")","v":""},null,{"$f":"IFERROR(INDEX(#REF!,MATCH(INPUT!$B31,#REF!,0)),\"\")","v":""}]
[{"$f":"IF(B32<>\"\",COUNTA($B$3:B32)&\"\",\"\")","v":""},null,{"$f":"IFERROR(INDEX(#REF!,MATCH(INPUT!$B32,#REF!,0)),\"\")","v":""}]
[{"$f":"IF(B33<>\"\",COUNTA($B$3:B33)&\"\",\"\")","v":""},null,{"$f":"IFERROR(INDEX(#REF!,MATCH(INPUT!$B33,#REF!,0)),\"\")","v":""}]
[{"$f":"IF(B34<>\"\",COUNTA($B$3:B34)&\"\",\"\")","v":""},null,{"$f":"IFERROR(INDEX(#REF!,MATCH(INPUT!$B34,#REF!,0)),\"\")","v":""}]
[{"$f":"IF(B35<>\"\",COUNTA($B$3:B35)&\"\",\"\")","v":""},null,{"$f":"IFERROR(INDEX(#REF!,MATCH(INPUT!$B35,#REF!,0)),\"\")","v":""}]
[{"$f":"IF(B36<>\"\",COUNTA($B$3:B36)&\"\",\"\")","v":""},null,{"$f":"IFERROR(INDEX(#REF!,MATCH(INPUT!$B36,#REF!,0)),\"\")","v":""}]
[{"$f":"IF(B37<>\"\",COUNTA($B$3:B37)&\"\",\"\")","v":""},null,{"$f":"IFERROR(INDEX(#REF!,MATCH(INPUT!$B37,#REF!,0)),\"\")","v":""}]
[{"$f":"IF(B38<>\"\",COUNTA($B$3:B38)&\"\",\"\")","v":""},null,{"$f":"IFERROR(INDEX(#REF!,MATCH(INPUT!$B38,#REF!,0)),\"\")","v":""}]
[{"$f":"IF(B39<>\"\",COUNTA($B$3:B39)&\"\",\"\")","v":""},null,{"$f":"IFERROR(INDEX(#REF!,MATCH(INPUT!$B39,#REF!,0)),\"\")","v":""}]
[{"$f":"IF(B40<>\"\",COUNTA($B$3:B40)&\"\",\"\")","v":""},null,{"$f":"IFERROR(INDEX(#REF!,MATCH(INPUT!$B40,#REF!,0)),\"\")","v":""}]
[{"$f":"IF(B41<>\"\",COUNTA($B$3:B41)&\"\",\"\")","v":""},null,{"$f":"IFERROR(INDEX(#REF!,MATCH(INPUT!$B41,#REF!,0)),\"\")","v":""}]
[{"$f":"IF(B42<>\"\",COUNTA($B$3:B42)&\"\",\"\")","v":""},null,{"$f":"IFERROR(INDEX(#REF!,MATCH(INPUT!$B42,#REF!,0)),\"\")","v":""}]
[{"$f":"IF(B43<>\"\",COUNTA($B$3:B43)&\"\",\"\")","v":""},null,{"$f":"IFERROR(INDEX(#REF!,MATCH(INPUT!$B43,#REF!,0)),\"\")","v":""}]
[{"$f":"IF(B44<>\"\",COUNTA($B$3:B44)&\"\",\"\")","v":""},null,{"$f":"IFERROR(INDEX(#REF!,MATCH(INPUT!$B44,#REF!,0)),\"\")","v":""}]
[{"$f":"IF(B45<>\"\",COUNTA($B$3:B45)&\"\",\"\")","v":""},null,{"$f":"IFERROR(INDEX(#REF!,MATCH(INPUT!$B45,#REF!,0)),\"\")","v":""}]
[{"$f":"IF(B46<>\"\",COUNTA($B$3:B46)&\"\",\"\")","v":""},null,{"$f":"IFERROR(INDEX(#REF!,MATCH(INPUT!$B46,#REF!,0)),\"\")","v":""}]
[{"$f":"IF(B47<>\"\",COUNTA($B$3:B47)&\"\",\"\")","v":""},null,{"$f":"IFERROR(INDEX(#REF!,MATCH(INPUT!$B47,#REF!,0)),\"\")","v":""}]
[{"$f":"IF(B48<>\"\",COUNTA($B$3:B48)&\"\",\"\")","v":""},null,{"$f":"IFERROR(INDEX(#REF!,MATCH(INPUT!$B48,#REF!,0)),\"\")","v":""}]
[{"$f":"IF(B49<>\"\",COUNTA($B$3:B49)&\"\",\"\")","v":""},null,{"$f":"IFERROR(INDEX(#REF!,MATCH(INPUT!$B49,#REF!,0)),\"\")","v":""}]
[{"$f":"IF(B50<>\"\",COUNTA($B$3:B50)&\"\",\"\")","v":""},null,{"$f":"IFERROR(INDEX(#REF!,MATCH(INPUT!$B50,#REF!,0)),\"\")","v":""}]
[{"$f":"IF(B51<>\"\",COUNTA($B$3:B51)&\"\",\"\")","v":""},null,{"$f":"IFERROR(INDEX(#REF!,MATCH(INPUT!$B51,#REF!,0)),\"\")","v":""}]
[{"$f":"IF(B52<>\"\",COUNTA($B$3:B52)&\"\",\"\")","v":""},null,{"$f":"IFERROR(INDEX(#REF!,MATCH(INPUT!$B52,#REF!,0)),\"\")","v":""}]
[{"$f":"IF(B53<>\"\",COUNTA($B$3:B53)&\"\",\"\")","v":""},null,{"$f":"IFERROR(INDEX(#REF!,MATCH(INPUT!$B53,#REF!,0)),\"\")","v":""}]
[{"$f":"IF(B54<>\"\",COUNTA($B$3:B54)&\"\",\"\")","v":""},null,{"$f":"IFERROR(INDEX(#REF!,MATCH(INPUT!$B54,#REF!,0)),\"\")","v":""}]
[{"$f":"IF(B55<>\"\",COUNTA($B$3:B55)&\"\",\"\")","v":""},null,{"$f":"IFERROR(INDEX(#REF!,MATCH(INPUT!$B55,#REF!,0)),\"\")","v":""}]
[{"$f":"IF(B56<>\"\",COUNTA($B$3:B56)&\"\",\"\")","v":""},null,{"$f":"IFERROR(INDEX(#REF!,MATCH(INPUT!$B56,#REF!,0)),\"\")","v":""}]
[{"$f":"IF(B57<>\"\",COUNTA($B$3:B57)&\"\",\"\")","v":""},null,{"$f":"IFERROR(INDEX(#REF!,MATCH(INPUT!$B57,#REF!,0)),\"\")","v":""}]
[{"$f":"IF(B58<>\"\",COUNTA($B$3:B58)&\"\",\"\")","v":""},null,{"$f":"IFERROR(INDEX(#REF!,MATCH(INPUT!$B58,#REF!,0)),\"\")","v":""}]
[{"$f":"IF(B59<>\"\",COUNTA($B$3:B59)&\"\",\"\")","v":""},null,{"$f":"IFERROR(INDEX(#REF!,MATCH(INPUT!$B59,#REF!,0)),\"\")","v":""}]
[{"$f":"IF(B60<>\"\",COUNTA($B$3:B60)&\"\",\"\")","v":""},null,{"$f":"IFERROR(INDEX(#REF!,MATCH(INPUT!$B60,#REF!,0)),\"\")","v":""}]
[{"$f":"IF(B61<>\"\",COUNTA($B$3:B61)&\"\",\"\")","v":""},null,{"$f":"IFERROR(INDEX(#REF!,MATCH(INPUT!$B61,#REF!,0)),\"\")","v":""}]
[{"$f":"IF(B62<>\"\",COUNTA($B$3:B62)&\"\",\"\")","v":""},null,{"$f":"IFERROR(INDEX(#REF!,MATCH(INPUT!$B62,#REF!,0)),\"\")","v":""}]
[{"$f":"IF(B63<>\"\",COUNTA($B$3:B63)&\"\",\"\")","v":""},null,{"$f":"IFERROR(INDEX(#REF!,MATCH(INPUT!$B63,#REF!,0)),\"\")","v":""}]
[{"$f":"IF(B64<>\"\",COUNTA($B$3:B64)&\"\",\"\")","v":""},null,{"$f":"IFERROR(INDEX(#REF!,MATCH(INPUT!$B64,#REF!,0)),\"\")","v":""}]
[{"$f":"IF(B65<>\"\",COUNTA($B$3:B65)&\"\",\"\")","v":""},null,{"$f":"IFERROR(INDEX(#REF!,MATCH(INPUT!$B65,#REF!,0)),\"\")","v":""}]
[{"$f":"IF(B66<>\"\",COUNTA($B$3:B66)&\"\",\"\")","v":""},null,{"$f":"IFERROR(INDEX(#REF!,MATCH(INPUT!$B66,#REF!,0)),\"\")","v":""}]
[{"$f":"IF(B67<>\"\",COUNTA($B$3:B67)&\"\",\"\")","v":""},null,{"$f":"IFERROR(INDEX(#REF!,MATCH(INPUT!$B67,#REF!,0)),\"\")","v":""}]
[{"$f":"IF(B68<>\"\",COUNTA($B$3:B68)&\"\",\"\")","v":""},null,{"$f":"IFERROR(INDEX(#REF!,MATCH(INPUT!$B68,#REF!,0)),\"\")","v":""}]
[{"$f":"IF(B69<>\"\",COUNTA($B$3:B69)&\"\",\"\")","v":""},null,{"$f":"IFERROR(INDEX(#REF!,MATCH(INPUT!$B69,#REF!,0)),\"\")","v":""}]
[{"$f":"IF(B70<>\"\",COUNTA($B$3:B70)&\"\",\"\")","v":""},null,{"$f":"IFERROR(INDEX(#REF!,MATCH(INPUT!$B70,#REF!,0)),\"\")","v":""}]
[{"$f":"IF(B71<>\"\",COUNTA($B$3:B71)&\"\",\"\")","v":""},null,{"$f":"IFERROR(INDEX(#REF!,MATCH(INPUT!$B71,#REF!,0)),\"\")","v":""}]
[{"$f":"IF(B72<>\"\",COUNTA($B$3:B72)&\"\",\"\")","v":""},null,{"$f":"IFERROR(INDEX(#REF!,MATCH(INPUT!$B72,#REF!,0)),\"\")","v":""}]
[{"$f":"IF(B73<>\"\",COUNTA($B$3:B73)&\"\",\"\")","v":""},null,{"$f":"IFERROR(INDEX(#REF!,MATCH(INPUT!$B73,#REF!,0)),\"\")","v":""}]
[{"$f":"IF(B74<>\"\",COUNTA($B$3:B74)&\"\",\"\")","v":""},null,{"$f":"IFERROR(INDEX(#REF!,MATCH(INPUT!$B74,#REF!,0)),\"\")","v":""}]
[{"$f":"IF(B75<>\"\",COUNTA($B$3:B75)&\"\",\"\")","v":""},null,{"$f":"IFERROR(INDEX(#REF!,MATCH(INPUT!$B75,#REF!,0)),\"\")","v":""}]
[{"$f":"IF(B76<>\"\",COUNTA($B$3:B76)&\"\",\"\")","v":""},null,{"$f":"IFERROR(INDEX(#REF!,MATCH(INPUT!$B76,#REF!,0)),\"\")","v":""}]
[{"$f":"IF(B77<>\"\",COUNTA($B$3:B77)&\"\",\"\")","v":""},null,{"$f":"IFERROR(INDEX(#REF!,MATCH(INPUT!$B77,#REF!,0)),\"\")","v":""}]
[{"$f":"IF(B78<>\"\",COUNTA($B$3:B78)&\"\",\"\")","v":""},null,{"$f":"IFERROR(INDEX(#REF!,MATCH(INPUT!$B78,#REF!,0)),\"\")","v":""}]
[{"$f":"IF(B79<>\"\",COUNTA($B$3:B79)&\"\",\"\")","v":""},null,{"$f":"IFERROR(INDEX(#REF!,MATCH(INPUT!$B79,#REF!,0)),\"\")","v":""}]
[{"$f":"IF(B80<>\"\",COUNTA($B$3:B80)&\"\",\"\")","v":""},null,{"$f":"IFERROR(INDEX(#REF!,MATCH(INPUT!$B80,#REF!,0)),\"\")","v":""}]
[{"$f":"IF(B81<>\"\",COUNTA($B$3:B81)&\"\",\"\")","v":""},null,{"$f":"IFERROR(INDEX(#REF!,MATCH(INPUT!$B81,#REF!,0)),\"\")","v":""}]
[{"$f":"IF(B82<>\"\",COUNTA($B$3:B82)&\"\",\"\")","v":""},null,{"$f":"IFERROR(INDEX(#REF!,MATCH(INPUT!$B82,#REF!,0)),\"\")","v":""}]
[{"$f":"IF(B83<>\"\",COUNTA($B$3:B83)&\"\",\"\")","v":""},null,{"$f":"IFERROR(INDEX(#REF!,MATCH(INPUT!$B83,#REF!,0)),\"\")","v":""}]
[{"$f":"IF(B84<>\"\",COUNTA($B$3:B84)&\"\",\"\")","v":""},null,{"$f":"IFERROR(INDEX(#REF!,MATCH(INPUT!$B84,#REF!,0)),\"\")","v":""}]
[{"$f":"IF(B85<>\"\",COUNTA($B$3:B85)&\"\",\"\")","v":""},null,{"$f":"IFERROR(INDEX(#REF!,MATCH(INPUT!$B85,#REF!,0)),\"\")","v":""}]
[{"$f":"IF(B86<>\"\",COUNTA($B$3:B86)&\"\",\"\")","v":""},null,{"$f":"IFERROR(INDEX(#REF!,MATCH(INPUT!$B86,#REF!,0)),\"\")","v":""}]
[{"$f":"IF(B87<>\"\",COUNTA($B$3:B87)&\"\",\"\")","v":""},null,{"$f":"IFERROR(INDEX(#REF!,MATCH(INPUT!$B87,#REF!,0)),\"\")","v":""}]
[{"$f":"IF(B88<>\"\",COUNTA($B$3:B88)&\"\",\"\")","v":""},null,{"$f":"IFERROR(INDEX(#REF!,MATCH(INPUT!$B88,#REF!,0)),\"\")","v":""}]
[{"$f":"IF(B89<>\"\",COUNTA($B$3:B89)&\"\",\"\")","v":""},null,{"$f":"IFERROR(INDEX(#REF!,MATCH(INPUT!$B89,#REF!,0)),\"\")","v":""}]
[{"$f":"IF(B90<>\"\",COUNTA($B$3:B90)&\"\",\"\")","v":""},null,{"$f":"IFERROR(INDEX(#REF!,MATCH(INPUT!$B90,#REF!,0)),\"\")","v":""}]
[{"$f":"IF(B91<>\"\",COUNTA($B$3:B91)&\"\",\"\")","v":""},null,{"$f":"IFERROR(INDEX(#REF!,MATCH(INPUT!$B91,#REF!,0)),\"\")","v":""}]
[{"$f":"IF(B92<>\"\",COUNTA($B$3:B92)&\"\",\"\")","v":""},null,{"$f":"IFERROR(INDEX(#REF!,MATCH(INPUT!$B92,#REF!,0)),\"\")","v":""}]
[{"$f":"IF(B93<>\"\",COUNTA($B$3:B93)&\"\",\"\")","v":""},null,{"$f":"IFERROR(INDEX(#REF!,MATCH(INPUT!$B93,#REF!,0)),\"\")","v":""}]
[{"$f":"IF(B94<>\"\",COUNTA($B$3:B94)&\"\",\"\")","v":""},null,{"$f":"IFERROR(INDEX(#REF!,MATCH(INPUT!$B94,#REF!,0)),\"\")","v":""}]
[{"$f":"IF(B95<>\"\",COUNTA($B$3:B95)&\"\",\"\")","v":""},null,{"$f":"IFERROR(INDEX(#REF!,MATCH(INPUT!$B95,#REF!,0)),\"\")","v":""}]
[{"$f":"IF(B96<>\"\",COUNTA($B$3:B96)&\"\",\"\")","v":""},null,{"$f":"IFERROR(INDEX(#REF!,MATCH(INPUT!$B96,#REF!,0)),\"\")","v":""}]
[{"$f":"IF(B97<>\"\",COUNTA($B$3:B97)&\"\",\"\")","v":""},null,{"$f":"IFERROR(INDEX(#REF!,MATCH(INPUT!$B97,#REF!,0)),\"\")","v":""}]
[{"$f":"IF(B98<>\"\",COUNTA($B$3:B98)&\"\",\"\")","v":""},null,{"$f":"IFERROR(INDEX(#REF!,MATCH(INPUT!$B98,#REF!,0)),\"\")","v":""}]
[{"$f":"IF(B99<>\"\",COUNTA($B$3:B99)&\"\",\"\")","v":""},null,{"$f":"IFERROR(INDEX(#REF!,MATCH(INPUT!$B99,#REF!,0)),\"\")","v":""}]
[{"$f":"IF(B100<>\"\",COUNTA($B$3:B100)&\"\",\"\")","v":""},null,{"$f":"IFERROR(INDEX(#REF!,MATCH(INPUT!$B100,#REF!,0)),\"\")","v":""}]
[{"$f":"IF(B101<>\"\",COUNTA($B$3:B101)&\"\",\"\")","v":""},null,{"$f":"IFERROR(INDEX(#REF!,MATCH(INPUT!$B101,#REF!,0)),\"\")","v":""}]
[{"$f":"IF(B102<>\"\",COUNTA($B$3:B102)&\"\",\"\")","v":""},null,{"$f":"IFERROR(INDEX(#REF!,MATCH(INPUT!$B102,#REF!,0)),\"\")","v":""}]
[{"$f":"IF(B103<>\"\",COUNTA($B$3:B103)&\"\",\"\")","v":""},null,{"$f":"IFERROR(INDEX(#REF!,MATCH(INPUT!$B103,#REF!,0)),\"\")","v":""}]
[{"$f":"IF(B104<>\"\",COUNTA($B$3:B104)&\"\",\"\")","v":""},null,{"$f":"IFERROR(INDEX(#REF!,MATCH(INPUT!$B104,#REF!,0)),\"\")","v":""}]
[{"$f":"IF(B105<>\"\",COUNTA($B$3:B105)&\"\",\"\")","v":""},null,{"$f":"IFERROR(INDEX(#REF!,MATCH(INPUT!$B105,#REF!,0)),\"\")","v":""}]
[{"$f":"IF(B106<>\"\",COUNTA($B$3:B106)&\"\",\"\")","v":""},null,{"$f":"IFERROR(INDEX(#REF!,MATCH(INPUT!$B106,#REF!,0)),\"\")","v":""}]
[{"$f":"IF(B107<>\"\",COUNTA($B$3:B107)&\"\",\"\")","v":""},null,{"$f":"IFERROR(INDEX(#REF!,MATCH(INPUT!$B107,#REF!,0)),\"\")","v":""}]
[{"$f":"IF(B108<>\"\",COUNTA($B$3:B108)&\"\",\"\")","v":""},null,{"$f":"IFERROR(INDEX(#REF!,MATCH(INPUT!$B108,#REF!,0)),\"\")","v":""}]
[{"$f":"IF(B109<>\"\",COUNTA($B$3:B109)&\"\",\"\")","v":""},null,{"$f":"IFERROR(INDEX(#REF!,MATCH(INPUT!$B109,#REF!,0)),\"\")","v":""}]
[{"$f":"IF(B110<>\"\",COUNTA($B$3:B110)&\"\",\"\")","v":""},null,{"$f":"IFERROR(INDEX(#REF!,MATCH(INPUT!$B110,#REF!,0)),\"\")","v":""}]
[{"$f":"IF(B111<>\"\",COUNTA($B$3:B111)&\"\",\"\")","v":""},null,{"$f":"IFERROR(INDEX(#REF!,MATCH(INPUT!$B111,#REF!,0)),\"\")","v":""}]
[{"$f":"IF(B112<>\"\",COUNTA($B$3:B112)&\"\",\"\")","v":""},null,{"$f":"IFERROR(INDEX(#REF!,MATCH(INPUT!$B112,#REF!,0)),\"\")","v":""}]
[{"$f":"IF(B113<>\"\",COUNTA($B$3:B113)&\"\",\"\")","v":""},null,{"$f":"IFERROR(INDEX(#REF!,MATCH(INPUT!$B113,#REF!,0)),\"\")","v":""}]
[{"$f":"IF(B114<>\"\",COUNTA($B$3:B114)&\"\",\"\")","v":""},null,{"$f":"IFERROR(INDEX(#REF!,MATCH(INPUT!$B114,#REF!,0)),\"\")","v":""}]
[{"$f":"IF(B115<>\"\",COUNTA($B$3:B115)&\"\",\"\")","v":""},null,{"$f":"IFERROR(INDEX(#REF!,MATCH(INPUT!$B115,#REF!,0)),\"\")","v":""}]
[{"$f":"IF(B116<>\"\",COUNTA($B$3:B116)&\"\",\"\")","v":""},null,{"$f":"IFERROR(INDEX(#REF!,MATCH(INPUT!$B116,#REF!,0)),\"\")","v":""}]
[{"$f":"IF(B117<>\"\",COUNTA($B$3:B117)&\"\",\"\")","v":""},null,{"$f":"IFERROR(INDEX(#REF!,MATCH(INPUT!$B117,#REF!,0)),\"\")","v":""}]
[{"$f":"IF(B118<>\"\",COUNTA($B$3:B118)&\"\",\"\")","v":""},null,{"$f":"IFERROR(INDEX(#REF!,MATCH(INPUT!$B118,#REF!,0)),\"\")","v":""}]
[{"$f":"IF(B119<>\"\",COUNTA($B$3:B119)&\"\",\"\")","v":""},null,{"$f":"IFERROR(INDEX(#REF!,MATCH(INPUT!$B119,#REF!,0)),\"\")","v":""}]
[{"$f":"IF(B120<>\"\",COUNTA($B$3:B120)&\"\",\"\")","v":""},null,{"$f":"IFERROR(INDEX(#REF!,MATCH(INPUT!$B120,#REF!,0)),\"\")","v":""}]
{"$rows_left_out":283}
{"sheet":"1","index":1,"n_rows":0,"n_cols":0,"rows_kept":0,"cut":false,"hidden":false,"merged":[[13,9,15,9],[13,10,15,10],[5,2,6,2],[9,0,9,9],[10,0,16,0],[10,3,10,10],[11,3,11,10],[13,3,15,3],[13,4,15,4],[13,5,15,5],[13,6,15,6],[13,7,15,7],[13,8,15,8]]}

{"sheet":"2","index":2,"n_rows":0,"n_cols":0,"rows_kept":0,"cut":false,"hidden":false,"merged":[[13,8,15,8],[13,9,15,9],[13,10,15,10],[5,2,6,2],[9,0,9,9],[10,0,16,0],[10,3,10,10],[11,3,11,10],[13,3,15,3],[13,4,15,4],[13,5,15,5],[13,6,15,6],[13,7,15,7]]}

{"sheet":"3","index":3,"n_rows":0,"n_cols":0,"rows_kept":0,"cut":false,"hidden":false,"merged":[[13,8,15,8],[13,9,15,9],[13,10,15,10],[5,2,6,2],[9,0,9,9],[10,0,16,0],[10,3,10,10],[11,3,11,10],[13,3,15,3],[13,4,15,4],[13,5,15,5],[13,6,15,6],[13,7,15,7]]}

{"sheet":"4","index":4,"n_rows":0,"n_cols":0,"rows_kept":0,"cut":false,"hidden":false,"merged":[[13,8,15,8],[13,9,15,9],[13,10,15,10],[5,2,6,2],[9,0,9,9],[10,0,16,0],[10,3,10,10],[11,3,11,10],[13,3,15,3],[13,4,15,4],[13,5,15,5],[13,6,15,6],[13,7,15,7]]}

{"sheet":"5","index":5,"n_rows":0,"n_cols":0,"rows_kept":0,"cut":false,"hidden":false,"merged":[[13,8,15,8],[13,9,15,9],[13,10,15,10],[5,2,6,2],[9,0,9,9],[10,0,16,0],[10,3,10,10],[11,3,11,10],[13,3,15,3],[13,4,15,4],[13,5,15,5],[13,6,15,6],[13,7,15,7]]}

{"sheet":"6","index":6,"n_rows":0,"n_cols":0,"rows_kept":0,"cut":false,"hidden":false,"merged":[[13,8,15,8],[13,9,15,9],[13,10,15,10],[5,2,6,2],[9,0,9,9],[10,0,16,0],[10,3,10,10],[11,3,11,10],[13,3,15,3],[13,4,15,4],[13,5,15,5],[13,6,15,6],[13,7,15,7]]}

{"sheet":"7","index":7,"n_rows":0,"n_cols":0,"rows_kept":0,"cut":false,"hidden":false,"merged":[[13,8,15,8],[13,9,15,9],[13,10,15,10],[5,2,6,2],[9,0,9,9],[10,0,16,0],[10,3,10,10],[11,3,11,10],[13,3,15,3],[13,4,15,4],[13,5,15,5],[13,6,15,6],[13,7,15,7]]}