{"text_format":"1","workbook":"xlsx","n_sheets":2,"sheets":["Sheet2","Sheet1"],"not_rendered":{"charts":0,"images":0,"macros":1,"external_links":0,"defined_names":0,"comments":0,"pivot_tables":0},"unopened":[],"bounds":{"document_bytes":16777216,"sheet_cells":100000,"rows_first":2000,"rows_last":500,"rows_between":2000,"halvings":0,"cell_chars":16384,"cell_head_chars":4096},"cells_cut":0,"cells_raw":0,"read":"whole","date_system":"1900"}

{"sheet":"Sheet2","index":0,"n_rows":11,"n_cols":2,"rows_kept":11,"cut":false,"hidden":false,"merged":[]}
[1,50.085271019976489]
[2,50.566095532088283]
[3,75.320192809868431]
[4,38.836407064770938]
[5,67.612572495026257]
[5,99.574669396926453]
[6,42.255359562609399]
[7,60.393637157376844]
[8,17.34230622372932]
[9,79.923594249004211]
[10,51.669931591414198]

{"sheet":"Sheet1","index":1,"n_rows":13,"n_cols":3,"rows_kept":13,"cut":false,"hidden":false,"merged":[]}
[null,"Filter",0]
[]
[1,{"$f":"VLOOKUP(A3,Sheet2!$A$1:$B$11,2,0)","v":50.085271019976489}]
[2,{"$f":"VLOOKUP(A4,Sheet2!$A$1:$B$11,2,1)","v":50.566095532088283}]
[3,{"$f":"VLOOKUP(A5,Sheet2!$A$1:$B$11,2,1)","v":75.320192809868431}]
[4,{"$f":"VLOOKUP(A6,Sheet2!$A$1:$B$11,2,0)","v":38.836407064770938}]
[5,{"$f":"VLOOKUP(A7,Sheet2!$A$1:$B$11,2,0)","v":67.612572495026257}]
[5,{"$f":"VLOOKUP(A8,Sheet2!$A$1:$B$11,2,1)","v":99.574669396926453}]
[6,{"$f":"VLOOKUP(A9,Sheet2!$A$1:$B$11,2,0)","v":42.255359562609399}]
[7,{"$f":"VLOOKUP(A10,Sheet2!$A$1:$B$11,2,0)","v":60.393637157376844}]
[8,{"$f":"VLOOKUP(A11,Sheet2!$A$1:$B$11,2,1)","v":17.34230622372932}]
[9,{"$f":"VLOOKUP(A12,Sheet2!$A$1:$B$11,2,0)","v":79.923594249004211}]
[10,{"$f":"VLOOKUP(A13,Sheet2!$A$1:$B$11,2,TRUE)","v":51.669931591414198}]